[mythtv-users] Mythtv compile error, latest CSV build 060205

Chad Delatte gremlin190 at yahoo.com
Fri Jun 3 00:56:34 UTC 2005

Hey guys I keep getting this erropr on a compile.  
make[2]: Entering directory
g++ -c -pipe -march=prescott -Wall -W -O3 -Wall
-Wno-switch -fomit-frame-pointer `freetype-config
--cflags` -D_REENTRANT -DPIC -fPIC  -DMMX -Di386
-I/usr/lib/qt-3.3/mkspecs/default -I.
-I/usr/local/include -I../.. -I../libmyth -I..
-Idvbdev -Impeg -I../libavcodec -I../libmythmpeg2
-I/usr/lib/qt-3.3/include -I/usr/X11R6/include
-I/usr/X11R6/include -o tv_play.o tv_play.cpp
tv_play.cpp: In member function `void
TV::ChangeAudioSync(int, bool)':
tv_play.cpp:3483: error:
`kOSDFunctionalType_AudioSyncAdjust' undeclared
(firstuse this function)
tv_play.cpp:3483: error: (Each undeclared identifier
is reported only once for each function it appears
tv_play.cpp: In member function `void
tv_play.cpp:3861: error:
`kOSDFunctionalType_AudioSyncAdjust' undeclared
(firstuse this function)
make[2]: *** [tv_play.o] Error 1
make[2]: Leaving directory
make[1]: *** [sub-libmythtv] Error 2
make[1]: Leaving directory `/home/mythtv/mythtv/libs'
make: *** [sub-libs] Error 2

I could compile without an error 2 days ago.  Any ideas?

Discover Yahoo! 
Have fun online with music videos, cool games, IM and more. Check it out! 

More information about the mythtv-users mailing list