[mythtv] Mac Accel compile issues

Geoffrey Kruse gkruse at gmail.com
Thu Aug 24 20:48:18 UTC 2006

Just went to (finally) test this to give nigel some feedback.  Using  
the --enable-mac-accel flag causes major compile errors that I  
haven't been able to fix yet.  Any suggestions?


videoout_accel_utils.mm:24: error: 'gDVDVState' was declared 'extern'  
and later 'static'
../libavcodec/dvdv.h:54: error: previous declaration of 'gDVDVState'
videoout_accel_utils.mm: In member function 'bool  
videoout_accel_utils.mm:594: error: 'struct AVCodecContext' has no  
member named 'accellent'
videoout_accel_utils.mm:597: error: 'struct AVCodecContext' has no  
member named 'accellent_enabled'
videoout_accel_utils.mm: In member function 'void  
AccelUtils::PostProcessFrame(AVCodecContext*, VideoFrame*, int, bool)':
videoout_accel_utils.mm:611: error: 'struct AVCodecContext' has no  
member named 'accellent_enabled'
make[2]: *** [videoout_accel_utils.o] Error 1
make[1]: *** [sub-libmythtv] Error 2
make: *** [sub-libs] Error 2
[osx-pkg] Failed system call: " /usr/bin/make " with error code 2
Died at ./osx-packager.pl line 838.

-------------- next part --------------
A non-text attachment was scrubbed...
Name: smime.p7s
Type: application/pkcs7-signature
Size: 2415 bytes
Desc: not available
Url : http://mythtv.org/pipermail/mythtv-dev/attachments/20060824/dc1f22d4/attachment.bin 

More information about the mythtv-dev mailing list