[mythtv] Compile failure on SVN 7203

Brian C. Huffman huffman at graze.net
Wed Sep 7 14:06:46 UTC 2005


I'm trying to compile mythtv and mythplugins (with debug) to sort out another
issue that I'm having....and I ended up with a compile issue on mythplugins
(mythmusic specifically).  Can someone suggest what I might do to troubleshoot
this?  I'm on Fedora Core 4 (gcc4).


gcc -c -pipe -march=pentium4 -march=pentium4 -Wall -W -g -D_REENTRANT
-DQT_SHARED -DQT_NO_DEBUG -I/usr/lib/qt-3.3/mkspecs/default -I.
-I/usr/include -I/usr/kde/3.3/include -I/usr/include

-I/usr/X11R6/include -I/usr/include

-I/usr/X11R6/include -I/usr/include/mythtv -I/usr/include/speech_tools
-I/usr/include/cdda -I/usr/lib/qt-3.3/include -I/usr/X11R6/include -o
zoom_filter_xmmx.o goom/zoom_filter_xmmx.c
{standard input}: Assembler messages:
{standard input}:129: Error: suffix or operands invalid for `movq'
{standard input}:130: Error: suffix or operands invalid for `movq'
make[2]: *** [zoom_filter_xmmx.o] Error 1
make[2]: Leaving directory

make[1]: *** [sub-mythmusic] Error 2
make[1]: Leaving directory
make: *** [sub-mythmusic] Error 2
error: Bad exit status from /var/tmp/rpm-tmp.72162 (%build)

More information about the mythtv-dev mailing list