[mythtv] Compile Error in Today's CVS

Rob Rosenfeld mythtv.org at rosenfeld.to
Fri Jun 3 01:05:32 UTC 2005

After make distclean . . . when I grep all of the mythtv module

 Entering directory `/root/download/mythtv/mythtv/libs/libmythtv'
ccache g++ -c -pipe -march=pentiumpro -Wall -W -O3 -Wall -Wno-switch 
-fomit-frame-pointer `freetype-config --cflags` -D_REENTRANT -DPIC 
-I/usr/qt/3/mkspecs/linux-g++ -I. -I/usr/include -I../.. -I../libmyth 
-I.. -Idvbdev -Impeg -I../libavcodec -I../libmythmpeg2 
-I/usr/qt/3/include -I/usr/include -I/usr/include -o tv_play.o tv_play.cpp
tv_play.cpp: In member function `void TV::ChangeAudioSync(int, bool)':
tv_play.cpp:3483: error: `kOSDFunctionalType_AudioSyncAdjust' undeclared 
   use this function)
tv_play.cpp:3483: error: (Each undeclared identifier is reported only 
once for
   each function it appears in.)
make[1]: *** [tv_play.o] Error 1
make[1]: Leaving directory `/root/download/mythtv/mythtv/libs/libmythtv'
make: *** [sub-libmythtv] Error 2

More information about the mythtv-dev mailing list