[mythtv] Compile error in latest cvs

Flo flokohlert at muenchen-mail.de
Sat Jul 3 13:27:15 EDT 2004

I get the following compile error in the latest cvs:
filldata.cpp: In function `void parseFile(QString, QValueList<ChanInfo>*,
   QMap<QString, QValueList<ProgInfo> >*)':
filldata.cpp:1448: error: Syntaxfehler before `<<' token
filldata.cpp:1470: error: `pginfo' undeclared (first use this function)
filldata.cpp:1470: error: (Each undeclared identifier is reported only once
   each function it appears in.)
filldata.cpp:1476: error: Syntaxfehler before `else'
filldata.cpp: At global scope:
filldata.cpp:1485: error: Syntaxfehler before `if'
filldata.cpp:1489: error: Syntaxfehler before `.' token
filldata.cpp:1496: error: Syntaxfehler before `.' token
filldata.cpp:1502: error: Syntaxfehler before `->' token
filldata.cpp:1503: error: Syntaxfehler before `.' token
filldata.cpp:1510: error: ISO C++ forbids declaration of `n' with no type
filldata.cpp:1510: error: request for member `nextSibling' in `n', which is
   non-aggregate type `int'
filldata.cpp:1511: error: Syntaxfehler before `}' token
make[2]: *** [filldata.o] Fehler 1
make[2]: Leaving directory
make[1]: *** [sub-mythfilldatabase] Fehler 2
make[1]: Leaving directory `/myth/tmp/mythcvs/mythtv/programs'
make: *** [sub-programs] Fehler 2

Already known?
-------------- next part --------------
An HTML attachment was scrubbed...
URL: http://mythtv.org/pipermail/mythtv-dev/attachments/20040703/0e05d09c/attachment.htm

More information about the mythtv-dev mailing list