[mythtv-users] mythtv .16 compile error

Jason jasonml at iconimaging.net
Tue Oct 5 05:15:39 UTC 2004

I seem to be having a compile error on a fresh slackware 10 install.

gcc 3.3.4 
2.4.26 kernel.

recordingprofile.cpp: In constructor `RTjpegQuality::RTjpegQuality(const
recordingprofile.cpp:275: internal compiler error: Segmentation fault
Please submit a full bug report,
with preprocessed source if appropriate.
See <URL:http://gcc.gnu.org/bugs.html> for instructions.
make[2]: *** [recordingprofile.o] Error 1
make[2]: Leaving directory `/home/jradford/mythtv-0.16/libs/libmythtv'
make[1]: *** [sub-libmythtv] Error 2
make[1]: Leaving directory `/home/jradford/mythtv-0.16/libs'
make: *** [sub-libs] Error 2

More information about the mythtv-users mailing list