[mythtv] win32 build script failing

Jonathan Martens jonathan at snetram.nl
Sun Jul 20 12:31:44 UTC 2008

After building mythtv succesful on Windows I unfortunately had to setup 
a new environment (I deleted parts of it accidentaly) and after doing so 
my build is failing with the following output:

Creating library file: liblibmythdb-0.22.a
make[2]: Leaving directory `/u/mythtv/mythtv/libs/libmythdb'
cd libmythupnp/ && make -f Makefile
make[2]: Entering directory `/u/mythtv/mythtv/libs/libmythupnp'
Makefile:193: warning: overriding commands for target `version.cpp'
Makefile:190: warning: ignoring old commands for target `version.cpp'
sh "/version.sh" "" ": http://svn.mythtv.org/svn/trunk/mythtv/version.pro "
sh: /version.sh: No such file or directory
make[2]: *** [version.cpp] Error 127
make[2]: Leaving directory `/u/mythtv/mythtv/libs/libmythupnp'
make[1]: *** [sub-libmythupnp-make_default-ordered] Error 2
make[1]: Leaving directory `/u/mythtv/mythtv/libs'
make: *** [sub-libs-make_default-ordered] Error 2
EFFECT FAILED (newer -> shell): mtime of file 
myth-0.22.dll) should be greater than file 
[0]  [1216547444]

U:\>dir U:\mythtv\mythtv\last_build.txt
  Volume in drive U is My Passport
  Volume Serial Number is 54A5-509E

  Directory of U:\mythtv\mythtv

20-07-2008  11:50                 0 last_build.txt
                1 File(s)              0 bytes
                0 Dir(s)  293,649,842,176 bytes free

Which is in accordance with the timestamp returned at the end of the 
error, as that converts to 20 July 2008 11:50:44.

Any one have a clue or a pointer?

Kind regards,


More information about the mythtv-dev mailing list