[mythtv] Probelms compiling newest SVN

Dag Nygren dag at newtech.fi
Sun Jan 15 09:26:31 UTC 2006

I just updated my svn version of mythtv to 8614 and there
seems to be a problem somewhere as it doesn't
compile but fails when trying to link mythuitest.
The message I get is:

cd mythuitest && make -f Makefile
make[2]: Entering directory `/net/backup/var/sources/vision/Mythtv-CVS/mythtv/p
g++  -o mythuitest main.o test1.o btnlisttest.o moc_test1.o   
-L/usr/lib/qt3//lib -L../../libs/libmyth -L../../libs/libmythui -lmythui-0.19 
-lmyth-0.19 -lfreetype -lmp3lame -lasound -ljack -ldvdnav -L/usr/X11R6/lib 
-lXinerama -lXv -lXxf86vm -lXrandr -lqt-mt -lGLU -lGL -lXmu -lXext -lX11 -lm 
/usr/bin/ld: BFD 20050720 assertion fail elflink.c:6208
/usr/bin/ld: mythuitest: hidden symbol `__fini_array_end' in mythuitest is 
referenced by DSO
/usr/bin/ld: final link failed: Nonrepresentable section on output
collect2: ld returned 1 exit status
make[2]: *** [mythuitest] Error 1
make[2]: Leaving directory `/net/backup/var/sources/vision/Mythtv-CVS/mythtv/pr
make[1]: *** [sub-mythuitest] Error 2
make[1]: Leaving directory `/net/backup/var/sources/vision/Mythtv-CVS/mythtv/pr
make: *** [sub-programs] Error 2

I have successfully compiled SVN before but just recently
updated my system to Mandriva 2006 so could well be the problem.

Any hints on where to start looking greatly appreciated.


More information about the mythtv-dev mailing list