[mythtv] CVS won't compile - tv_rec.h

Michael Haas hansi.urpils at gmail.com
Sun Jun 5 09:54:37 UTC 2005


I'm getting this error when i try to compile latest CVS on my Ubuntu machine:

g++ -c -pipe -march=pentium4 -Wall -W -O3 -Wall -Wno-switch
-fomit-frame-pointer `freetype-config --cflags` -D_REENTRANT -DPIC
-I/usr/share/qt3/mkspecs/default -I. -I/usr/local/include -I../..
-I../libmyth -I.. -Idvbdev -Impeg -I../libavcodec -I../libmythmpeg2
-I/usr/include/qt3 -o guidegrid.o guidegrid.cpp
In file included from tv.h:21,
                 from guidegrid.cpp:27:
tv_rec.h:244: error: parse error before `<<' token
tv_rec.h:247: error: parse error before `==' token
tv_rec.h:249: error: declaration of `bool TVRec::autoTranscode'
tv_rec.h:246: error: conflicts with previous declaration `int 
tv_rec.h:250: error: parse error before `>>' token
make[2]: *** [guidegrid.o] Error 1
make[2]: Leaving directory `/home/laga/myth-cvs/mythtv/libs/libmythtv'
make[1]: *** [sub-libmythtv] Error 2
make[1]: Leaving directory `/home/laga/myth-cvs/mythtv/libs'
make: *** [sub-libs] Error 2

Am I missing something, or is this indeed a bug?

Michael 'laga' Haas

More information about the mythtv-dev mailing list