[mythtv] CVS Compiler problem postprocess.c in /mythtv/libs/libavcodec

Stefan Manteuffel linux at sm-recycling.de
Mon Oct 11 08:49:15 UTC 2004

Hello List

after i had  loaded the cvs for mythtv i can not compile it any more. 
The .16 and 15.1 was compiled on my suse 9.0 with any Problems.
Here ist compiler output

I hope some on know waht is wrong and sorry for that english ;)

make[2]: Entering directory 
gcc -c -pipe -O2 -march=i586 -mcpu=i686 -fmessage-length=0 -fPIC -w -g -O 
-I/usr/lib/qt3/mkspecs/default -I. -I../.. -I/usr/include 
-I/usr/lib/qt3/include -o postprocess.o libpostproc/postprocess.c
In file included from libpostproc/postprocess.c:648:
libpostproc/postprocess_template.c: In function `postProcess_MMX':
libpostproc/postprocess_template.c:3169: error: can't find a register in class 
`GENERAL_REGS' while reloading `asm'
libpostproc/postprocess_template.c:3252: error: can't find a register in class 
`GENERAL_REGS' while reloading `asm'
make[2]: *** [postprocess.o] Fehler 1
make[2]: Leaving directory 
make[1]: *** [sub-libavcodec] Fehler 2
make[1]: Leaving directory `/home/stefan/src/mythtv-cvs/mythtv/libs'
make: *** [sub-libs] Fehler 2

has anyone an idear what is wrong ?

Gossamer and google cant't help


-------------- next part --------------
mythtv-users mailing list
mythtv-users at mythtv.org

More information about the mythtv-dev mailing list